[guardian-dev] Build failed in Jenkins: Orbot #35

gp-jenkins-bot at guardianproject.info gp-jenkins-bot at guardianproject.info
Fri Feb 24 00:16:06 EST 2012


See <https://build.safermobile.org/job/Orbot/35/changes>

Changes:

[nathan] updates for manually setting locales

[nathan] updated version 1.0.7.2 and project info

------------------------------------------
Started by an SCM change
Building in workspace <https://build.safermobile.org/job/Orbot/ws/>
Checkout:workspace / <https://build.safermobile.org/job/Orbot/ws/> - hudson.remoting.LocalChannel at 4afe5d97
Using strategy: Default
Last Built Revision: Revision b4952ea44d50299cdd0f3b83dc6de4b21f97339a (origin/master)
Checkout:workspace / <https://build.safermobile.org/job/Orbot/ws/> - hudson.remoting.LocalChannel at 4afe5d97
Fetching changes from 1 remote Git repository
Fetching upstream changes from https://git.torproject.org/n8fr8/orbot.git
Commencing build of Revision a773ff35f826fedd0b3f8f197de44eb4fef9f214 (origin/master)
Checking out Revision a773ff35f826fedd0b3f8f197de44eb4fef9f214 (origin/master)
Starting xvnc
[workspace] $ /usr/bin/Xvnc4 :10 -localhost -desktop jenkins at build.safermobile.org:10 -auth /var/lib/jenkins/.Xauthority -rfbauth /var/lib/jenkins/.vnc/passwd -pn -fp /usr/X11R6/lib/X11/fonts/Type1/,/usr/X11R6/lib/X11/fonts/Speedo/,/usr/X11R6/lib/X11/fonts/misc/,/usr/X11R6/lib/X11/fonts/75dpi/,/usr/X11R6/lib/X11/fonts/100dpi/,/usr/share/fonts/X11/misc/,/usr/share/fonts/X11/Type1/,/usr/share/fonts/X11/75dpi/,/usr/share/fonts/X11/100dpi/ -co /etc/X11/rgb

Xvnc Free Edition 4.1.1 - built Mar 10 2010 22:35:30
Copyright (C) 2002-2005 RealVNC Ltd.
See http://www.realvnc.com for information on VNC.
Underlying X server release 40300000, The XFree86 Project, Inc

[android] Using Android SDK: /usr/local/android-sdk
$ /usr/local/android-sdk/platform-tools/adb start-server

Fri Feb 24 00:15:57 2012
 vncext:      VNC extension running!
 vncext:      Listening for VNC connections on port 5910
 vncext:      created VNC server for screen 0
error opening security policy file /etc/X11/xserver/SecurityPolicy
Could not init font path element /usr/X11R6/lib/X11/fonts/Type1/, removing from list!
Could not init font path element /usr/X11R6/lib/X11/fonts/Speedo/, removing from list!
Could not init font path element /usr/X11R6/lib/X11/fonts/misc/, removing from list!
Could not init font path element /usr/X11R6/lib/X11/fonts/75dpi/, removing from list!
Could not init font path element /usr/X11R6/lib/X11/fonts/100dpi/, removing from list!
Could not init font path element /usr/share/fonts/X11/75dpi/, removing from list!
Could not init font path element /usr/share/fonts/X11/100dpi/, removing from list!
$ /usr/local/android-sdk/tools/emulator -snapshot-list -no-window -avd hudson_en-US_160_HVGA_android-8
[android] Starting Android emulator from snapshot
$ /usr/local/android-sdk/tools/emulator -no-boot-anim -ports 60053,34362 -prop persist.sys.language=en -prop persist.sys.country=US -avd hudson_en-US_160_HVGA_android-8 -snapshot jenkins -no-snapshot-save
waitpid(): No child processes
emulator: warning: opening audio output failed

* daemon not running. starting it now on port 56569 *
* daemon started successfully *
$ /usr/local/android-sdk/platform-tools/adb connect localhost:34362
[android] Waiting for emulator to finish booting...
$ /usr/local/android-sdk/platform-tools/adb -s localhost:34362 shell getprop dev.bootcomplete
$ /usr/local/android-sdk/platform-tools/adb -s localhost:34362 logcat -v time
$ /usr/local/android-sdk/platform-tools/adb connect localhost:34362
[android] Emulator is ready for use (took 6 seconds)
[workspace] $ /bin/sh -xe /tmp/hudson2010036708480315016.sh
+ . /var/lib/jenkins/.android/bashrc
+ export NDK_BASE=/usr/local/android-ndk
+ export NDK_TOOLCHAIN_BASE=/usr/local/android-ndk/toolchains/arm-linux-androideabi-4.4.3/prebuilt/linux-x86
+ export SDK_BASE=/usr/local/android-sdk
+ export SDK_TOOLS=/usr/local/android-sdk/tools
+ export SDK_PLATFORM_TOOLS=/usr/local/android-sdk/platform-tools
+ export PATH=/usr/local/bin:/usr/bin:/bin:/usr/local/games:/usr/games:/usr/local/android-ndk:/usr/local/android-ndk/toolchains/arm-linux-androideabi-4.4.3/prebuilt/linux-x86/bin:/usr/local/android-sdk/tools:/usr/local/android-sdk/platform-tools
+ android update project --path . --name Orbot --target android-8
Updated default.properties
Updated local.properties
File build.xml is too old and needs to be updated.
Updated file ./build.xml
[workspace] $ ant clean debug
Buildfile: <https://build.safermobile.org/job/Orbot/ws/build.xml>
    [setup] Android SDK Tools Revision 11
    [setup] Project Target: Android 2.2
    [setup] API level: 8
    [setup] 
    [setup] ------------------
    [setup] Resolving library dependencies:
    [setup] No library dependencies.
    [setup] 
    [setup] ------------------
    [setup] 
    [setup] WARNING: Attribute minSdkVersion in AndroidManifest.xml (4) is lower than the project target API level (8)
    [setup] 
    [setup] Importing rules file: tools/ant/main_rules.xml

clean:
   [delete] Deleting directory <https://build.safermobile.org/job/Orbot/ws/bin>
   [delete] Deleting directory <https://build.safermobile.org/job/Orbot/ws/gen>

-debug-obfuscation-check:

-set-debug-mode:

-compile-tested-if-test:

-pre-build:

-dirs:
     [echo] Creating output directories if needed...
    [mkdir] Created dir: <https://build.safermobile.org/job/Orbot/ws/bin>
    [mkdir] Created dir: <https://build.safermobile.org/job/Orbot/ws/gen>
    [mkdir] Created dir: <https://build.safermobile.org/job/Orbot/ws/bin/classes>

-aidl:
     [echo] Compiling aidl files into Java classes...

-renderscript:
     [echo] Compiling RenderScript files into Java classes and RenderScript bytecode...

-resource-src:
     [echo] Generating R.java / Manifest.java from the resources...
     [aapt] <https://build.safermobile.org/job/Orbot/ws/res/xml/preferences.xml>:27: error: Error: No resource found that matches the given name (at 'entryValues' with value '@array/languages_values').
     [aapt] <https://build.safermobile.org/job/Orbot/ws/res/xml/preferences.xml>:27: error: Error: No resource found that matches the given name (at 'entries' with value '@array/languages').

BUILD FAILED
/usr/local/android-sdk/tools/ant/main_rules.xml:310: null returned: 1

Total time: 1 second
Build step 'Invoke Ant' marked build as failure
$ /usr/local/android-sdk/platform-tools/adb disconnect localhost:34362
[android] Stopping Android emulator
[android] Archiving emulator log
$ /usr/local/android-sdk/platform-tools/adb kill-server
Taking screenshot.
[workspace] $ import -window root -display :10 screenshot.jpg
Terminating xvnc.
Archiving artifacts



More information about the Guardian-dev mailing list